Quantcast
Channel: Questions in topic: "build-error"
Browsing index pages (2401 articles)

Build failed and get this Fatal error in Unity CIL Linker when I make Il2cpp...

Exception: Failed running C:\Program Files\Unity\Hub\Editor\2020.3.8f1\Editor\Data\il2cpp\build/deploy/netcoreapp3.1/UnityLinker.exe...

View Article


Build failed with error “Build completed with a result of 'Failed'”

Hi all, I’m having an issue building my Unity project and could use some help. Whenever I try to build, I get the error "Build completed with a result of 'Failed'”. I have tried the following to...

View Article


Unity VR Game Build Hiccup,Unity VR Game Hiccup

![alt text][1]So I'm creating a VR game for Google Cardboard utilising the 2022 version. I recently updated my Unity version and installed a package named GUI after downloading the Google Cardboard...

View Article

Unity unusable due to Internal build system error. BuildProgram exited with...

**Unity Version 2022.2.18** I was using unity DOTS to test performance, but after some work it ended up only causing issues so i decided not to use it. In order to do that i removed every package...

View Article

Export Issue- Misaligned canvas UI elements

Hello, I have an app where when the user clicks a button a scrollable canvas element with info pops up. At the bottom of the canvas there is a nav bar with right, left, and home buttons which will...

View Article


How to compress streaming assets in Unity 2022 onward

In Unity 2017 we compressed our streaming assets by creating a Custom Gradle Template and removing `**STREAMING_ASSETS**` from `noCompress` of `aaptOptions`. In Unity 2022, I have tried using a similar...

View Article

BuildPlayerWindow + BuildMethodException error. Please help me!

**Hello! I recently started working on a project and I've looked at the other forums, tried pretty much everything to solve this problem and nothing worked. I'm super stressed and it feels like it just...

View Article

Unity Build error,Unity Build Error

Im trying to Build an Android APK, i followed an tutorial, installed sdk, etc. but when i try building it, i get this errors UnityEditor.BuildPlayerWindow+BuildMethodException: 2 errors at...

View Article


Xiaomi devices showing error on build

jni: getdevicename:java.lang.securityexception: settings key: bluetooth_name is only readable to apps with targetsdkversion lower than or equal to: 31 I get this message only with Xiaomi devices after...

View Article


Build windows client via linux

Build windows client with BuildPipeline.BuildPlayer in lunix. But in the result all textures is lost.Where to look for them? And how to add them to build?

View Article

Failure to Build for Android Platform

Good Day ...Trying to build my game for the Android Platform to be on Oculus Meta Quest 2 .....I am faced with these errors. Any help with that ..Appreciate Building...

View Article

Errors when activating ARM64 in VR application

Hola! estoy realizando una aplicaion para VR, pero cuido quiera hacer build me da estos errores. [Screenshot][1] [1]: https://gyazo.com/c5ed4b9a41a462b07e66aef9878e4ed5 Eso si, solo pasa si activo el...

View Article

HELP BuildFailedException: Burst Compiler (1.8.2) failed running |...

> Unity 2021.3.16f1 >> Windows 10>> Build Target: Android >> Scripting Engine: IL2CPP ......... Trying to build for Meta Quest 2 URP 12.1.8 requires Burst 1.8.2 But for some...

View Article


Why is Unity "Build And Run" treating my old APK like a folder?

Usually when I use build and run on my projects, Unity overwrites the last APK. In this new project, Unity always asks where to store the APK and the old APK is treated like a folder for some reason....

View Article

GameObject not working?

The build game doesn't work like in the editor. I have a GameObject list and it should put the objects in it as they spawn, but that doesn't happen. Tried just writing the name of the GameObject onto...

View Article


Wwise - Can't build from Windows to MacOSX,Wwise issue when building for...

Hey everybody! I'm doing a course using Unity 2020.3.25f1 and Wwise 2021.1.5. I'm running into an issue where I can build to PC just fine, but, whenever I try running for MacOS, the build will fail and...

View Article

Build webgl error: listen EADDRINUSE: address already in use :::54998

Previously, it was successful to build webgl using 2019.4.18f1, but this upgrade to 2021.3.16f1 encountered an error: ------------------------------------ [websockify wrapper] [ERROR] events.js:292...

View Article


Can't build for iOS with version 2023.1.0b9 or above

In the Xcode (v14.2) project I get the following error: /Users/[username]/Documents/Projects/[projectname]/Build/Il2CppOutputProject/Source/il2cppOutput/GenericMethods1.cpp:25279:7 use of undeclared...

View Article

Unity gradle build error. Java problem

I added google play's ad plugins to my game. After that I started getting multiple gradle build failure errors. I spent 7 days to solve only gradle problems. After errors I downloaded recommended...

View Article

I cant build and run my project

im just trying to build my game... UnityEditor.BuildPlayerWindow+BuildMethodException: 16 errors at UnityEditor.BuildPlayerWindow+DefaultBuildMethods.BuildPlayer (UnityEditor.BuildPlayerOptions...

View Article
Browsing index pages (2401 articles)


Latest Images